Bronceado
type: Concept
broader: Metalizado
definition: Pintura de una superficie para darle la apariencia del bronce. En impresión, se refiere a imprimir con tintas metálicas.
definition: Pintura d'una superfície per a donar-li l'aparença del bronze. En impressió, es referix a imprimir amb tintes metàl·liques. @ca
definition: The treatment of a surface to give the appearance of bronze. In printmaking, refers to printing with metallic inks. @en
in scheme: Actividades
preferred label: Bronzejat @ca
preferred label: Bronzing @en

Metalizado
type: Concept
narrower: Bronceado
preferred label: Metal·litzat @ca
preferred label: Metallizing @en

Actividades
type: ConceptScheme
preferred label: Activitats @ca
preferred label: Activities @en