Plafón
type: Concept
broader: Lámpara de pared
definition: Del fr. plafond. Lámpara plana traslúcida, que se coloca pegada al techo para disimular las bombillas.
definition: Del fr. plafond, íd., comp. de plat aplatat i fond fondo. Llum pla translúcid, que es col·loca pegada al sostre per a dissimular les bombetes. @ca
definition: Translucent flat lamp, which is attached to the ceiling to conceal the light bulbs. @en
in scheme: Objetos
preferred label: Plafó @ca
preferred label: Ceiling light @en

Lámpara de pared
type: Concept
narrower: Plafón
preferred label: Làmpara de paret @ca
preferred label: Wall lamp @en

Objetos
type: ConceptScheme
preferred label: Objectes @ca
preferred label: Objects @en