Cintura
type: Concept
alternative label: Bastidor
alternative label: bastidor @ca
broader: Componentes del mobiliario
definition: Bastidor que soporta los pies de un mueble, sobre el que se apoyan asientos o los tableros de las mesas y consolas
definition: Bastidor que suporta els peus d'un moble, sobre el qual es donen suport a seients o els taulers de les taules i consoles @en
definition: Frame supporting the feet of a piece of furniture, on which seats or table and console tops are supported. @en
in scheme: Objetos
preferred label: Stretcher (componente) @en

Componentes del mobiliario
type: Concept
narrower: Cintura
preferred label: Components del mobiliari @ca
preferred label: Furnishings components @en

Objetos
type: ConceptScheme
preferred label: Objectes @ca
preferred label: Objects @en