Paragüero
type: Concept
broader: Base por función
definition: Soportes o receptáculos para contener paraguas, por lo general situados en el interior de una casa u otro edificio cerca de una puerta exterior. El término se utiliza para soportes de metal o de madera de construcción, así como para vasos grandes en forma de cilindro de cerámica, metal o de otro material, diseñado y utilizado para contener paraguas.
definition: Suports o receptacles per a contindre paraigües, en general situats a l'interior d'una casa o un altre edifici prop d'una porta exterior. El terme s'utilitza per a suports de metall o de fusta de construcció, així com per a gots grans en forma de cilindre de ceràmica, metall o d'un altre material, dissenyat i utilitzat per a contindre paraigua. @ca
definition: Stands or receptacles for holding umbrellas, generally located inside a home or other building near an exterior door. The term is used for stands of metal or wood construction as well as for large cylinder-shaped vessels of ceramic, metal, or another material, designed and used for holding umbrellas. @en
in scheme: Objetos
preferred label: Paraigüer @ca
preferred label: Umbrella stand @en

Base por función
type: Concept
narrower: Paragüero
preferred label: Base per funció @ca
preferred label: Stand by function @en

Objetos
type: ConceptScheme
preferred label: Objectes @ca
preferred label: Objects @en