Jaspeado
type: Concept
broader: Pintado
definition: Del part. de jaspear. Técnica decorativa que, a través de la aplicación de pigmentos, imita las vetas y salpicaduras del jaspe en la superficie de varios objetos como papel, tejidos o muros.
definition: Tècnica decorativa que, a través de l'aplicació de pigments, imita les vetes i esquitxades del jaspi en la superfície de diversos objectes com a paper, teixits o murs. @ca
definition: A decorative technique which, through the application of pigments, imitates the veins and splashes of jasper on the surface of various objects such as paper, fabrics or walls. @en
in scheme: Actividades
preferred label: Jaspiat @ca
preferred label: Marbled @en

Pintado
type: Concept
narrower: Jaspeado
preferred label: Pintat @ca
preferred label: Painting @en

Actividades
type: ConceptScheme
preferred label: Activitats @ca
preferred label: Activities @en