Muñeca bebé
type: Concept
broader: Muñeca
preferred label: Nina bebé @ca
preferred label: Baby doll @en

Muñeca
type: Concept
alternative label: Muñeco
alternative label: Dummy @en
alternative label: Nino @ca
broader: Juguete por forma
definition: Doll, nickname for Dorothy. Figurines representing humans or animals, including but not restricted to those intended as toys for children, usually girls, or as collectibles for adults. Dolls are commonly in the form of a baby or woman, often with changeable clothes; they may have moveable arms and legs. Doll may be made of cloth (rag dolls), wood, clay, porcelain, wax, paper, plastic, celluloid, corn husks, or other materials. Dolls may also be figurines used for ceremonial, religious, or decorative purposes. Archaeological evidence suggests that dolls were the first playthings; they have been found in Babylonian and Egyptian tombs from ca. 3000 BCE. In ancient Greece and Rome, maturing girls consecrated their childhood dolls to the goddesses. Cloth dolls in the form of animals are generally called "stuffed toys." @en
definition: Dun ll. vg. *ninus, -a infant petit, de creació expressiva infantil. Figura que representa a persones o animals i que serveix de joguet o com a objecte de col·lecció. Sol tindre la forma d'un bebé o d'una figura femenina, de braços i cames mòbils, i sovint amb roba per a vestir-la. Pot estar feta de drap, fusta, porcellana, cera, paper, plàstic, fulles de dacsa, etc. Algunes figures poden ser utilitzades amb finalitats cerimonials o religiosos. L'evidència arqueològica suggereix que van ser els primers joguets i s'han trobat en tombes de Babilònia i Egipte des del 3000 a. C. aproximadament. En l'antiga Grècia i Roma, les xiquetes que maduraven consagraven les nines de la seua infància a les deesses. El ninot de tela amb forma d'animal es denomina generalment peluix. @ca
definition: La forma f., de or. prerromano; cf. moño, muñón, vasco muno 'colina1', etc. Figura que representa a personas o animales y que sirve de juguete o como objeto de colección. Suele tener la forma de un bebé o de una figura antropomorfa, de brazos y piernas móviles, y a menudo con ropa para vestirla. Puede estar hecha de trapo, madera, porcelana, cera, papel, plástico, hojas de maíz, etc. Algunas figuras pueden ser utilizadas con fines ceremoniales o religiosos. La evidencia arqueológica sugiere que fueron los primeros juguetes y se han encontrado en tumbas de Babilonia y Egipto desde el 3000 a. C. aproximadamente. En la antigua Grecia y Roma, las niñas que maduraban consagraban las muñecas de su infancia a las diosas. El muñeco de tela con forma de animal se denomina generalmente peluche.
in scheme: Objetos
narrower: Peluche
narrower: Muñeca bebé
narrower: Muñeca personaje
narrower: Muñeca de tela
narrower: Autómata (muñecas)
preferred label: Doll @en
preferred label: Nina @ca

Muñeca personaje
type: Concept
broader: Muñeca
preferred label: Nina personatge @ca
preferred label: Character doll @en

Autómata (muñecas)
type: Concept
broader: Muñeca
preferred label: Nina autòmat @ca
preferred label: Mechanical doll @en

Juguete por forma
type: Concept
narrower: Muñeca
preferred label: Joguet per forma @ca
preferred label: Toys by form @en

Muñeca de tela
type: Concept
broader: Muñeca
preferred label: Nina de drap @ca
preferred label: Cloth doll @en

Peluche
type: Concept
broader: Muñeca
preferred label: Peluix @ca
preferred label: Stuffed toy @en

Objetos
type: ConceptScheme
preferred label: Objectes @ca
preferred label: Objects @en