Juego educativo
type: Concept
alternative label: Juguete educativo
alternative label: Joguet edutcatiu @ca
alternative label: Educational toy @en
broader: Juguete instructivo
definition: Juego o juguete con una función didáctica.
definition: Joc o joguet amb una funció didàctica. @ca
definition: Game or toy with an educational function. @en
in scheme: Objetos
preferred label: Joc educatiu @ca
preferred label: Educational game @en

Juguete instructivo
type: Concept
narrower: Juego educativo
preferred label: Joguet instructiu @ca
preferred label: Educational toy @en

Objetos
type: ConceptScheme
preferred label: Objectes @ca
preferred label: Objects @en