Diseño industrial
type: Concept
narrower: Mobiliario y equipo
preferred label: Disseny industrial @ca
preferred label: Industrial design @en

Mobiliario y equipo
type: Concept
broader: Diseño industrial
definition: Esta jerarquía contiene términos para objetos que son principalmente muebles y que brindan comodidad, conveniencia o protección a lugares como viviendas o negocios, u otros espacios públicos o privados. Pueden ser útiles u ornamentales, y usarse en espacios interiores o exteriores.
definition: Esta jerarquia conté termes per a objectes que són principalment mobles i que brinden comoditat, conveniència o protecció a llocs com a vivendes o negocis, o altres espais públics o privats. Poden ser útils o ornamentals, i usar-se en espais interiors o exteriors. @ca
definition: The Furnishings and Equipment hierarchy contains terms for objects that are primarily movable that provide comfort, convenience, or protection in dwellings, places or business, or other public or private spaces. They may be useful or ornamental and may be used in indoor or outdoor spaces. Regarding other Hierarchies: Terms for objects with the primary purpose of storage receptacles or other forms of container (e.g., "candle boxes," "footlockers") are in the Containers hierarchy. @en
in scheme: Objetos
narrower: Mobiliario por localización y contexto
narrower: Contenedores
narrower: Mobiliario por forma y función
preferred label: Mobiliari i equip @ca
preferred label: Furnishings and Equipment @en

Mobiliario por localización y contexto
type: Concept
broader: Mobiliario y equipo
preferred label: Mobiliari per localització i context @ca
preferred label: Furnishing by location or context @en

Contenedores
type: Concept
broader: Mobiliario y equipo
preferred label: Contenidors @ca
preferred label: Containers @en

Mobiliario por forma y función
type: Concept
broader: Mobiliario y equipo
preferred label: Mobiliari per forma i funció @ca
preferred label: Furnishings by form or function @en

Objetos
type: ConceptScheme
preferred label: Objectes @ca
preferred label: Objects @en