Taburete
type: Concept
broader: Mobiliario de asiento individual sin respaldo
definition: RAE Del fr. tabouret. Asiento individual, sin respaldo ni brazos, de pie abierto o cerrado. En este caso puede albergar un cajón bajo el asiento, para papeles, útiles de costura, libros, etc. Para darles mayor estabilidad a menudo se construyen con alzado troncopiramidal. Existen también asientos altos denominados «taburetes» junto a barras y mostradores, aunque a veces tienen respaldo. Por lo general sus patas son rectas o dispuestas transversalmente. Ciertos taburetes desempeñanron también la función de mesitas y pueden estar tapizados. Fue el tipo de mobiliario de asiento más común hasta el siglo XIX.
definition: De tambor 1a font: 1696, DLac. Seient individual, sense respatler ni braços, dempeus obert o tancat. En aquest cas pot albergar un calaix sota el seient, per a papers, útils de costura, llibres, etc. Per a donar-los major estabilitat sovint es construeixen amb alçat piramidal. Existeixen també seients alts denominats «tamborets» al costat de barres i taulells, encara que a vegades tenen suport. En general les seues potes són rectes o disposades transversalment. N'hi ha baixos i alts per a acostar a la taula. Uns certs tamborets van exercir també la funció de tauletes i poden estar entapissats. Va ser el tipus de mobiliari de seient més comú fins al segle XIX. @ca
definition: Old English st?l; related to Old Norse st?ll, Gothic st?ls, Old High German stuol chair, Greek stulos pillar. Individual seat, without backrest or armrests, open or closed upright. It might house a drawer under the seat for papers, sewing tools, books, etc. To give them greater stability, they are often built with a truncated pyramid-shaped top. There are also high seats called "stools'' next to bars and counters, although they sometimes have a backrest. Their legs are usually straight or crosswise. Some stools also function as tables and may be upholstered. It was the most common type of seating furniture until the 19th century. @en
in scheme: Objetos
narrower: Taburete por función
narrower: Tabuerte por forma
preferred label: Tamboret @ca
preferred label: Stool @en

Tabuerte por forma
type: Concept
broader: Taburete

Taburete por función
type: Concept
broader: Taburete

Mobiliario de asiento individual sin respaldo
type: Concept
narrower: Taburete
preferred label: Mobiliari de seient individual sense respatler @ca
preferred label: Individual seating furniture without backrest @en

Objetos
type: ConceptScheme
preferred label: Objectes @ca
preferred label: Objects @en