Componentes por contexto general
type: Concept
narrower: Cuello
preferred label: Components per context general @ca
preferred label: Components by general context @en

Cuello
type: Concept
broader: Componentes por contexto general
definition: Del lat. collum. Parte superior y más estrecha de una vasija o similar.
definition: Del ll. c?llum. Part superior i més estreta d'un atuell o similar. @ca
definition: The upper and narrower part of a vessel or similar. @en
in scheme: Objetos
preferred label: Coll @ca
preferred label: Neck @en

Objetos
type: ConceptScheme
preferred label: Objectes @ca
preferred label: Objects @en