Charolado
type: Concept
broader: Lacado
definition: Del part. de charolar. La técnica del lacado y de acabado duro que utiliza muchas capas de barniz compuesto por goma laca disuelta en alcohol, luego pulido y decorado, habitualmente en estilo y tema oriental. Originalmente desarrollado como un substituto para el lacado oriental original.
definition: La tècnica del lacatge i d'acabat dur que utilitza moltes capes de vernís compost per goma laca dissolta en alcohol, després polit i decorat, habitualment en estil i tema oriental. Originalment desenvolupat com un substitut per al lacatge oriental original. @ca
definition: The hard-finish lacquering technique which utilizes many coats of varnish composed of shellac dissolved in spirit, then polished and decorated, usually Oriental in style and subject matter. Originally developed as a substitute for genuine Oriental lacquer which was popular during the second half of the 17th century. @en
in scheme: Actividades
preferred label: Xarolat @ca
preferred label: Japanning @en

Lacado
type: Concept
narrower: Charolado
preferred label: Lacat @ca
preferred label: Lacquering @en

Actividades
type: ConceptScheme
preferred label: Activitats @ca
preferred label: Activities @en