Leather working technique
type: Concept
broader: Processes and techniques by material
definition: Conjunto de procedimientos técnicos empleados en el tratamiento de curtido y fabricación de la piel, así como en la decoración y acabado de la piel curtida (cuero). @es
definition: Conjunt de procediments tècnics emprats en el tractament d'adobat i fabricació de la pell, així com en la decoració i acabat de la pell adobada (cuir).
definition: It refers to the set of technical procedures used in the tanning treatment and manufacture of leather, as well as in the decoration and finishing of tanned leather (leather).
in scheme: Activities
narrower: Tanning processes and techniques
preferred label: Procesos y técnicas de cuero y piel @es
preferred label: Processos i tècniques de cuir @ca

Tanning processes and techniques
type: Concept
broader: Leather working technique
preferred label: Procesos y técnicas del curtido @es
preferred label: Processos i tècniques de l'adobat @ca

Processes and techniques by material
type: Concept
narrower: Leather working technique
preferred label: Procesos y técnicas por material @es
preferred label: Processos i tècniques per material @ca

Activities
type: ConceptScheme
preferred label: Actividades @es
preferred label: Activitats @ca