Proyector de cine
type: Concept
broader: Juguete por función
definition: Juguete que sirve para proyectar imágenes e imita a un proyector de cine real.
definition: Joguet que servix per a projectar imatges i imita a un projector de cinema real. @ca
definition: Toy used to project images and imitates a real cinema projector. @en
in scheme: Objetos
preferred label: Projector de cinema @ca
preferred label: Film projector @en

Juguete por función
type: Concept
narrower: Proyector de cine
preferred label: Joguet per funció @ca
preferred label: Toys by function @en

Objetos
type: ConceptScheme
preferred label: Objectes @ca
preferred label: Objects @en