Entalladura
type: Concept
alternative label: Entallamant
broader: Processos i tècniques sobre fusta
definition: Corte profundo realizado en la madera que se utiliza para ensamblar piezas o como filete. @es
definition: Tall profund realitzat en la fusta que s'utilitza per a assemblar peces o com a filet.
definition: A deep cut into wood used to assemble pieces or as a fillet. @en
in scheme: Activitats
preferred label: Groove @en

Processos i tècniques sobre fusta
type: Concept
narrower: Entalladura
preferred label: Procesos y técnicas sobre madera @es
preferred label: Processes and techniques for woodworking @en

Activitats
type: ConceptScheme
preferred label: Actividades @es
preferred label: Activities @en