Atornillado
type: Concept
broader: Unión
definition: Acción de sujetar, cerrar o asegurar con un tornillo o tornillos insertados.
definition: Acció de subjectar, tancar o assegurar amb un caragol o caragols inserits. @ca
definition: The action of attaching, closing, or securing with an inserted screw or screws. @en
in scheme: Actividades
preferred label: Caragolat @ca
preferred label: Screwing @en

Unión
type: Concept
narrower: Atornillado
preferred label: Unió @ca
preferred label: Join @en

Actividades
type: ConceptScheme
preferred label: Activitats @ca
preferred label: Activities @en