Mobiliario infantil
type: Concept
narrower: Trona
preferred label: Mobiliari infantil @ca
preferred label: Children's furnishing @en

Trona
type: Concept
alternative label: silla para niños
broader: Mobiliario infantil
definition: De trono. Silla de patas altas para dar de comer al bebé, que puede estar provista de una mesa articulada y a veces con reposapiés y brazos.También suelen tener un sistema de sujeción para el niño. En Europa se conservan ejemplares desde fines del siglo XVI.
definition: Del b. ll. tribuna púlpit. Silla de potes altes per a donar menjar al bebé, que pot estar proveïda d'una taula articulada i a vegades amb reposapeus i braços. També solen tindre un sistema de subjecció per al xiquet. A Europa es conserven exemplars des de fins del segle XVI. @ca
definition: 184050; high + chair. High-legged feeding chair, which may be fitted with a hinged table and sometimes with footrests and armrests. They are also often fitted with a child restraint system. Examples have been preserved in Europe since the late 16th century. @en
in scheme: Objetos
preferred label: Highchair @en

Objetos
type: ConceptScheme
preferred label: Objectes @ca
preferred label: Objects @en