Botella
type: Concept
alternative label: Ampolla
broader: Atifell
definition: Del fr. bouteille, y este del lat. buttic?la.Recipiente o vasija comúnmente de vidrio o plástico que tiene un cuello y una boca más estrechas que el cuerpo. Se suelen utilizar para envasar y contener líquidos, o preparaciones secas. @es
definition: Recipient o atuell comunament de vidre o plàstic que té un coll i una boca més estretes que el cos. Se solen utilitzar per a envasar i contindre líquids, o preparacions seques.
definition: A container or vessel, usually made of glass or plastic, with a neck and mouth narrower than the body. They are often used to package and contain liquids or dry preparations. @en
in scheme: Objectes
preferred label: Bottle @en

Atifell
type: Concept
narrower: Botella
preferred label: Vasija @es
preferred label: Pot @en

Objectes
type: ConceptScheme
preferred label: Objetos @es
preferred label: Objects @en