Elementos de arquitectura
type: Concept
narrower: Puerta
preferred label: Elements d'arquitectura @ca
preferred label: Architectural elements @en

Puerta
type: Concept
broader: Elementos de arquitectura
definition: Del lat. porta. Barreras que se balancean, se deslizan, se inclinan o se pliegan para separar espacios interiores, generalmente de construcción sólida y terminada que conducen o separan espacios. También de características similares que cierran un mueble o contenedor.
definition: Barreres que es balancegen, es llisquen, s'inclinen o es pleguen per a separar espais interiors, generalment de construcció sòlida i acabada que conduïxen o separen espais. També de característiques similars que tanquen un moble o contenidor. @ca
definition: Barriers that swing, slide, tilt, or fold to close a doorway, usually of solid and finished construction and usually leading to or separating interior spaces. Use also for similar features that close a container or a piece of case furniture. @en
in scheme: Objetos
preferred label: Porta @ca
preferred label: Door @en

Objetos
type: ConceptScheme
preferred label: Objectes @ca
preferred label: Objects @en