Oreja
type: Concept
alternative label: orejera
alternative label: ear @en
broader: Componentes de respaldo
definition: Del lat. auric?la. Cada una de las piezas salientes en la parte superior de un respaldo y que permite que la cabeza descanse lateralmente. La oreja puede ser fija o móvil. A menudo se encuentran en las butacas del tipo confesional, desde el siglo XVIII y en las sillas Chippendale.
definition: Del ll. auric?la, dimin. de auris, íd. Cadascuna de les peces sortints en la part superior d'un suport i que permet que el cap descanse lateralment. L'orella pot ser fixa o mòbil. Sovint es troben en les butaques del tipus confessional, des del segle XVIII i en les cadires Chippendale. @ca
definition: n. Old English ?are; related to Old Norse eyra, Old High German ?ra, Gothic aus?, Greek ous, Latin auris. Each of the up-curved ends of a crest rail that allows the head to rest laterally. The ear may be fixed or movable. Often found in armchairs of the fauteuils à oreilles, from the 18th century and in Chippendale chairs. @en
in scheme: Objetos
preferred label: Orella @ca
preferred label: Ears @en

Componentes de respaldo
type: Concept
narrower: Oreja
preferred label: Components del respatler @ca
preferred label: Back components @en

Objetos
type: ConceptScheme
preferred label: Objectes @ca
preferred label: Objects @en