Mobiliario de asiento individual con respaldo
type: Concept
narrower: Butaca
preferred label: Mobiliari de seient individual amb respatler @ca
preferred label: Individual seating furniture with backrest @en

Sillón sapo
type: Concept
broader: Butaca
preferred label: Silló gripau @ca
preferred label: Toad chair @en

Butaca
type: Concept
broader: Mobiliario de asiento individual con respaldo
definition: Del cumanagoto putaca 'asiento'. Asiento bajo, mullido y envolvente con brazos y respaldo henchidos y tapizados, semejante a un sillón pero generalmente menos voluminoso. Estos asientos de comodidad se desarrollan desde mediados del siglo XIX.
definition: Del cast. butaca, i aquest, del cumanagoto (dialecte carib de Veneçuela) putaka seient. Seient baix, esponjós i envolupant amb braços i respatler plens i entapissats, semblant a una butaca però generalment menys voluminós. Aquests seients de comoditat es desenvolupen des de mitjan segle XIX. @ca
definition: Low, soft and enveloping seat with upholstered, padded arms and backrest, similar to an armchair but generally less voluminous. These comfort seats were developed from the mid-19th century onwards. @en
in scheme: Objetos
narrower: Butaca de teatro
narrower: Sillón Bibendum
narrower: Sillón sapo
preferred label: Butaca (seient baix) @ca
preferred label: Easy chair (seat) @en

Butaca de teatro
type: Concept
broader: Butaca
preferred label: Butaca d'espectacles @ca
preferred label: Show seating @en

Sillón Bibendum
type: Concept
broader: Butaca
preferred label: Cadira Bibendum @ca
preferred label: Bibendum chair @en

Objetos
type: ConceptScheme
preferred label: Objectes @ca
preferred label: Objects @en