Fleco
type: Concept
broader: Pasamanería
definition: De flueco, y este del lat. floccus. Adorno compuesto de una serie de hilos o cordoncillos colgantes de una tira de tela o de pasamanería.
definition: Del ll. fl?ccus borrall de llana. Adorn compost d'una sèrie de fils o *cordoncillos penjants d'una tira de tela o de passamaneria. @ca
definition: n. From the Middle English "frenge" and the Old French "frenge". It determines an ornamental bordering, that is, pendant cords, either loose threads or formed into tassels, twists, etc. @en
in scheme: Objetos
preferred label: Floc @ca
preferred label: Fringe @en

Pasamanería
type: Concept
narrower: Fleco
preferred label: Passamaneria @ca
preferred label: Passementerie @en

Objetos
type: ConceptScheme
preferred label: Objectes @ca
preferred label: Objects @en