Elemento preparatorio industrial
type: Concept
narrower: Boceto industrial
preferred label: Element preparatori industrial @ca
preferred label: Industrial preparatory element @en

Boceto industrial
type: Concept
broader: Elemento preparatorio industrial
definition: Proyecto o apunte general previo a la ejecución de una pieza de diseño industrial.
definition: Projecte o apunt general previ a l'execució d'una peça de disseny industrial. @ca
definition: Project or general outline prior to the execution of a piece of industrial design. @en
in scheme: Objetos
preferred label: Esbós industrial @ca
preferred label: Industrial sketch @en

Objetos
type: ConceptScheme
preferred label: Objectes @ca
preferred label: Objects @en