Componentes por contexto general
type: Concept
narrower: Cantonera
preferred label: Components per context general @ca
preferred label: Components by general context @en

Cantonera
type: Concept
broader: Componentes por contexto general
definition: De abrazar y -dera. Abrazaderas de metal, generalmente hierro, con las que se refuerzan o protegen las uniones de esquina o cantones.
definition: De abraçar. Abraçadores de metall, generalment ferro, amb les quals es reforcen o protegeixen les unions de cantonada o cantons. @ca
definition: Decorative protective metal pieces attached to the corners of the cover of a book. @en
in scheme: Objetos
preferred label: Cornerpieces @en

Objetos
type: ConceptScheme
preferred label: Objectes @ca
preferred label: Objects @en