Elementos de arquitectura
type: Concept
narrower: Balaustre (componente de arquitectura)
preferred label: Elements d'arquitectura @ca
preferred label: Architectural elements @en

Balaustre (componente de arquitectura)
type: Concept
alternative label: balaústre (componente de arquitectura)
broader: Elementos de arquitectura
definition: Columna o pilar de pequeño tamaño que formando una serie que constituye la balaustrada. Suele ser de sección circular y perfil sinuoso, en forma de jarrón. Consta de pie, panza o parte abultada a veces hemisférica, cuello o garganta y capitel. Se hacen de piedra, madera o hierro y de formas variadas. Sirve de apoyo y forma las barandillas y antepechos de los balcones, azoteas, escaleras y corredores.
definition: De lit. balaustro, íd., del ll. balaustium, i aquest, del gr. balaústion flor del magraner, per comparació de la inflor del balustre amb aquella flor. Columna o pilar de xicoteta grandària que formant una sèrie i constitueix la balustrada. Sol ser de secció circular i perfil sinuós, en forma de pitxer. Consta dempeus, panxa o part inflada a vegades hemisfèrica, coll o gola i capitell. Es fan de pedra, fusta o ferro i de formes variades. Serveix de suport i forma les baranes i ampits dels balcons, terrats, escales i corredors. @ca
definition: n. from French balustre, from Italian balaustro pillar resembling a pomegranate flower, ultimately from Greek balaustion. Short vertical members used to support a stair handrail or coping, often circular in section with a vase-shaped outline. It consists of a foot, a belly or bulging part, made of different shapes. They are made of stone, wood or iron and come in a variety of shapes. They support and form the railings and parapets of balconies, roofs, stairways and corridors. @en
in scheme: Objetos
preferred label: Balustre (component d'arquitectura) @ca
preferred label: Baluster (architecture component) @en

Objetos
type: ConceptScheme
preferred label: Objectes @ca
preferred label: Objects @en