Juego de café
type: Concept
broader: Juego de mesa
definition: Servicios hechos para servir café, generalmente consisten en una cafetera, un pote para crema, azucarero y a menudo una bandeja para servir. También puede incluir juegos de tazas y recipiente para conservar el café caliente, platillos o platos de postre.
definition: Servicis fets per a servir café, generalment consistixen en una cafetera, un pot per a crema, sucrera i sovint una safata per a servir. També pot incloure jocs de tasses i recipient per a conservar el café calent, platerets o plats per a postres. @ca
definition: Services intended for use in serving coffee generally consisting of a coffeepot, creamer, sugar bowl, and often a matching tray. May also include matching cups and urn, saucers, or dessert plates. @en
in scheme: Objetos
preferred label: Joc de café @ca
preferred label: Coffee services @en

Juego de mesa
type: Concept
narrower: Juego de café
preferred label: Joc de taula @ca
preferred label: Tableware @en

Objetos
type: ConceptScheme
preferred label: Objectes @ca
preferred label: Objects @en