Unión
type: Concept
narrower: Atado
preferred label: Unió @ca
preferred label: Join @en

Atado
type: Concept
broader: Unión
definition: Del part. de atar. Acción de sujetar una cosa a otra, o dos o más cosas juntas, con un trozo de cuerda, cordel, soga u otro cabo flexible.
definition: Acció de subjectar una cosa a una altra, o dos o més coses juntes, amb un tros de corda, cordill, soga o un altre cap flexible. @ca
definition: The action of fastening one thing to another, or two or more things together, with a length of cord, string, rope, or other flexible line. @en
in scheme: Actividades
preferred label: Lligat @ca
preferred label: Tying @en

Actividades
type: ConceptScheme
preferred label: Activitats @ca
preferred label: Activities @en