Elementos de arquitectura
type: Concept
narrower: Arco
preferred label: Elements d'arquitectura @ca
preferred label: Architectural elements @en

Arco
type: Concept
broader: Elementos de arquitectura
definition: Del lat. arcus. Elemento estructural típicamente curvo, que comprende una abertura y se sostiene en los apoyos verticales situados a ambos lados. También, elemento estructural o independiente que se asemeja a un arco o que actúa estructuralmente como tal. Según su forma hay muchos tipos de arco como por ejemplo arco carpanel, arco de medio punto
definition: Del ll. arcus, íd. 1a font: s. XIII. Element estructural típicament corb, que comprén una obertura i se sosté en els suports verticals situats a banda i banda. També, element estructural o independent que s'assembla a un arc o que actua estructuralment com a tal. Segons la seua forma hi ha molts tipus d'arc com per exemple arquege carpanell, arc de mig punt @ca
definition: From Old French arche, from Vulgar Latin arca (unattested), from Latin arcus bow. Structural elements, typically curved, spanning openings and transmitting vertical loads to either side of the opening. Also, structural elements or freestanding structures that resemble arches or act structurally like arches. Depending on their shape, there are many types of arches, e.g., pointed arches, round arches @en
in scheme: Objetos
preferred label: Arc @ca
preferred label: Arch @en

Objetos
type: ConceptScheme
preferred label: Objectes @ca
preferred label: Objects @en