Pie
type: Concept
narrower: Zapata
preferred label: Peu @ca
preferred label: Foot @en

Zapata
type: Concept
broader: Pie
definition: De zapato. Pieza, generalmente de madera, puesta encima un pie derecho, una columna, etc., que soporta una viga u otro elemento horizontal.
definition: Dorigen incert; malgrat de ser un mot comú en la majoria de llengües romàniques i daltres de no romàniques (eslaves, turc, àrab, persa), no shi veu relació etimològica entre elles. Peça, generalment de fusta, posada damunt un peu dret, una columna, etc., que suporta una biga o altre element horitzontal. @ca
definition: A piece, usually made of wood, placed on top of a right foot, a column, etc., which supports a beam or other horizontal element. @en
in scheme: Objetos
preferred label: Sabata @ca
preferred label: Footing @en

Objetos
type: ConceptScheme
preferred label: Objectes @ca
preferred label: Objects @en