Lámpara de mesa
type: Concept
narrower: Candelabro
preferred label: Làmpada de taula @ca
preferred label: Table lamp @en

Candelabro
type: Concept
broader: Lámpara de mesa
definition: Portavelas con dos o más brazos.
definition: Del ll. vg. *candel?brum en lloc del ll. cl. candelabrum, íd. 1a font: s. XIII, Vides. Utensili consistent en un peu o una columna més o menys llargs, de dos braços o més, amb dolles per a aguantar dretes altres tantes candeles. @ca
definition: Candleholders with two or more arms. @en
in scheme: Objetos
preferred label: Canelobre @ca
preferred label: Candelabras @en

Objetos
type: ConceptScheme
preferred label: Objectes @ca
preferred label: Objects @en