Unió
type: Concept
narrower: Empalmament
preferred label: Unión @es
preferred label: Join @en

Empalmament
type: Concept
alternative label: entroncament
broader: Unió
definition: Técnica de unión de dos elementos para obtener una pieza de mayor longitud. Es un sistema de unión muy habitual en cualquier técnica ya que sólo hace falta acoplar o entrelazar dos piezas entre sí, a continuación una de otra. @es
definition: Tècnica d'unió de dos elements per a obtindre una peça de major longitud. És un sistema d'unió molt habitual en qualsevol tècnica ja que només fa falta acoblar o entrellaçar dos peces entre si, a continuació l'una de l'altra.
definition: Technique for joining two elements to obtain a longer piece. It is a very common joining system in any technique as it is only necessary to couple or interlock two pieces together, one after the other. @en
in scheme: Activitats
preferred label: Empalme @es
preferred label: Joinery (wood technic) @en

Activitats
type: ConceptScheme
preferred label: Actividades @es
preferred label: Activities @en