Muñeca
type: Concept
narrower: Muñeca de tela
preferred label: Nina @ca
preferred label: Doll @en

Muñeca de tela
type: Concept
alternative label: muñeca de trapo
broader: Muñeca
definition: Muñecas con cuerpos de tela o tela rellena con varios materiales, como trapos, aserrín, u hojas de papiro.
definition: Nines amb cossos de tela o tela farcida amb diversos materials, com a draps, serradures, o fulles de papir. @ca
definition: Dolls with bodies of cloth or cloth stuffed with various materials, as rags, sawdust, or papyrus leaves. @en
in scheme: Objetos
preferred label: Nina de drap @ca
preferred label: Cloth doll @en

Objetos
type: ConceptScheme
preferred label: Objectes @ca
preferred label: Objects @en