Esmaltado
type: Concept
broader: Revestido
definition: Proceso de aplicación de una cobertura vítrea al metal, cerámica, vidrio u otras superficies por fusión, usando calor en un horno o incinerador, con el resultado de crear una superficie suave y dura.
definition: Procés d'aplicació d'una cobertura vítria al metall, ceràmica, vidre o altres superfícies per fusió, usant calor en un forn o incinerador, amb el resultat de crear una superfície suau i dura. @ca
definition: The process of applying a vitreous coating to metal, ceramic, glass, or other surfaces by fusion using heat in a kiln or furnace, with the result of creating a smooth, hard surface. @en
in scheme: Actividades
narrower: Cloisonné
preferred label: Esmaltat @ca
preferred label: Enameling @en

Cloisonné
type: Concept
broader: Esmaltado

Revestido
type: Concept
narrower: Esmaltado
preferred label: Revestit @ca
preferred label: Coating @en

Actividades
type: ConceptScheme
preferred label: Activitats @ca
preferred label: Activities @en