Silla de cocina
type: Concept
broader: Silla por función
definition: Asiento realizado para ser usado en mesas de cocina con materiales fáciles de limpiar. Ocasionalmente puede llevar peldaños desplegables o a modo de escalerilla.
definition: Seient realitzat per a ser usat en taules de cuina amb materials fàcils de netejar. Ocasionalment pot portar escalons desplegables o a manera d'escaleta. @ca
definition: Seat made for use on kitchen tables with easy-to-clean @en
in scheme: Objetos
preferred label: Cadira de cuina @ca
preferred label: Kitchen chair @en

Silla por función
type: Concept
narrower: Silla de cocina
preferred label: Cadira per funció @ca
preferred label: Chairs by function @en

Objetos
type: ConceptScheme
preferred label: Objectes @ca
preferred label: Objects @en