Grupo de elementos que serven para contener o servir alimentos.
type: Concept
narrower: Tetera
preferred label: Contenidors per servir i consumir aliments @ca
preferred label: Containers for use in a kitchen, or for cooking. @en

Tetera
type: Concept
broader: Grupo de elementos que serven para contener o servir alimentos.
definition: Vasija de metal, loza, porcelana o barro que se utiliza para preparar y servir el té. Generalmente presenta un pico provisto de un colador interior o exterior, largo y curvado, en el lado opuesto a la vasija. También cuenta con tapadera, asa y alguna vez un pequeño pie.
definition: Atuell de metall, pisa, porcellana o fang que s'utilitza per a preparar i servir el te. Generalment presenta un broc proveït d'un colador interior o exterior, llarg i corbat, en el costat oposat a l'atuell. També compta amb tapadora, ansa i alguna vegada un xicotet peu. @ca
definition: A metal, stoneware, porcelain or earthenware vessel used for preparing and serving tea. It usually has a spout with a long, curved inner or outer strainer on the side opposite the pot. It also has a lid, handle and sometimes a small foot. @en
in scheme: Objetos
preferred label: Teapot @en

Objetos
type: ConceptScheme
preferred label: Objectes @ca
preferred label: Objects @en