Mobiliario y equipo
type: Concept
narrower: Contenedores
preferred label: Mobiliari i equip @ca
preferred label: Furnishings and Equipment @en

Contenedores por función
type: Concept
broader: Contenedores
preferred label: Contenidors per funció @ca
preferred label: Containers by function or context @en

Contenedores por localización
type: Concept
broader: Contenedores
preferred label: Contenidors per localització @ca
preferred label: Containers by location @en

Contenedores
type: Concept
broader: Mobiliario y equipo
definition: La jerarquía Contenedores contiene descriptores para los artefactos utilizados para contener sustancias u objetos. Se incluyen descripciones de contenedores destinados para uso culinario, uso hortícola, cuidado de la salud, higiene y necesidades personales similares, así como los descriptores de los contenedores funerarios asociados a la liturgia, y otras actividades ceremoniales.
definition: La jerarquia Contenidors conté descriptors per als artefactes utilitzats per a contindre substàncies o objectes. S'inclouen descripcions de contenidors destinats per a ús culinari, ús hortícola, cuidat de la salut, higiene i necessitats personals similars, així com els descriptors dels contenidors funeraris associats a la litúrgia, i altres activitats cerimonials. @ca
definition: The Containers hierarchy contains terms for objects used to hold substances or other objects. Included are terms for containers intended for culinary use, for horticultural use, for health care, hygiene, and similar personal needs as well as terms for containers associated with liturgical, funerary, and other ceremonial activities. @en
in scheme: Objetos
narrower: Contenedores por localización
narrower: Contenedores por función
narrower: Contenedores por forma
preferred label: Contenidors @ca
preferred label: Containers @en

Contenedores por forma
type: Concept
broader: Contenedores
preferred label: Contenidors per forma @ca
preferred label: Containers by form @en

Objetos
type: ConceptScheme
preferred label: Objectes @ca
preferred label: Objects @en