Mobiliario de asiento individual con respaldo
type: Concept
narrower: Mecedora
preferred label: Mobiliari de seient individual amb respatler @ca
preferred label: Individual seating furniture with backrest @en

Mecedora
type: Concept
alternative label: balancín (mueble)
alternative label: balancí (moble) @ca
broader: Mobiliario de asiento individual con respaldo
definition: V. mecedor. Asiento con balancines que oscila hacia delante y hacia atrás. Es una silla de brazos cuyas patas se encuentran montadas sobre soportes curvos, generalmente de madera o de metal, lo que permite que la silla pueda moverse hacia adelante y hacia atrás. Por lo general tienen respaldo y asiento de rejilla o lona.
definition: Seient amb balancins que oscil·la cap avant i cap endarrere. És una cadira de braços les potes dels quals es troben muntades sobre suports corbs, generalment de fusta o de metall, la qual cosa permet que la cadira puga moure's cap avant i cap endarrere. En general tenen respatler i seient de reixeta o lona. @ca
definition: n. [175060, Amer.]. Chairs that are built on two curved pieces of wood or metal so that you can rock yourself backwards and forwards when you are sitting in it. They usually have a mesh or canvas backrest and seat. @en
in scheme: Objetos
preferred label: Engrunsadora @ca
preferred label: Rock chair @en

Objetos
type: ConceptScheme
preferred label: Objectes @ca
preferred label: Objects @en