Silla de tocador
type: Concept
broader: Silla por función
definition: Silla empleada comúnmente por las mujeres para ser peinadas en el tocador que son características por tener el respaldo bajo.
definition: Silla emprada comunment per les dones per a ser pentinades en el tocador que són característiques per tindre el respatller baix. @ca
definition: A chair commonly used by women to comb their hair in the boudoir, characteristically with a low backrest. @en
in scheme: Objetos
preferred label: Cadira de tocador @ca
preferred label: Boudoir chair @en

Silla por función
type: Concept
narrower: Silla de tocador
preferred label: Cadira per funció @ca
preferred label: Chairs by function @en

Objetos
type: ConceptScheme
preferred label: Objectes @ca
preferred label: Objects @en