Sofá Chesterfield
type: Concept
alternative label: Sofá Chéster
alternative label: Chester @ca
alternative label: Sofa Chester @en
broader: Sofá
definition: Sofás tapizados en piel completamente acolchados sin partes de madera a la vista, de respaldo y brazos ligeramente exvasados. De origen inglés, una de las principales aportaciones de sus principales aportaciones a la historia del diseño al ser uno de los símbolos del diseño británico en los interiores más clásicos y conservadores. De hecho, está asociado a las estancias masculinas, debido a su fama al ser un mueble exclusivo donde se sentaban las élites de los clubs privados de Londres, donde sólo podían entrar hombres. Se considera adecuado para salas de billar, halls y bibliotecas.
definition: Sofàs entapissats en pell completament embuatats sense parts de fusta a la vista, de respatler i braços lleugerament exvasats. D'origen anglés, una de les principals aportacions de les seues principals aportacions a la història del disseny en ser un dels símbols del disseny britànic en els interiors més clàssics i conservadors. De fet, està associat a les estades masculines, a causa de la seua fama a l'ésser un moble exclusiu on s'asseien les elits dels clubs privats de Londres, on només podien entrar homes. Es considera adequat per a sales de billar, halls i biblioteques. @ca
definition: Fully upholstered leather sofas with no exposed wooden parts, with slightly curved backrest and armrests. Of English origin, one of the main contributions of its main contributions to the history of design, being one of the symbols of British design in the most classic and conservative interiors. In fact, it is associated with masculine rooms, due to its fame as an exclusive piece of furniture where the elite sat in London's private clubs, where only men could enter. It is considered suitable for billiard rooms, halls and libraries. @en
in scheme: Objetos
preferred label: Sofà Chesterfield @ca
preferred label: Chesterfields @en

Sofá
type: Concept
narrower: Sofá Chesterfield
preferred label: Sofà @ca
preferred label: Sofa @en

Objetos
type: ConceptScheme
preferred label: Objectes @ca
preferred label: Objects @en