Mesa por localización o contexto
type: Concept
narrower: Mesa de centro
preferred label: Taula per localització i context @ca
preferred label: Table by location or context @en

Mesa de centro
type: Concept
broader: Mesa por localización o contexto
definition: Mesas de diversas formas, terminadas en todos los lados y destinadas a usarse en el centro de una habitación, a menudo combinadas con otros muebles del salón. La ornamentación es similar en todos sus lados, dado que todo su perímetro es visible.
definition: Taules de diverses formes, acabades en tots els costats i destinades a usar-se en el centre d'una habitació, sovint combinades amb altres mobles del saló. L'ornamentació és similar en tots els seus costats, atés que tot el seu perímetre és visible. @ca
definition: It refers to those tables intended to be used in the center of a room often in combination with other living room furniture. They appear in various shapes, all of them finished. The ornamentation is similar on all sides, as the entire perimeter is visible. @en
in scheme: Objetos
preferred label: Taula de centre @ca
preferred label: Center table @en

Objetos
type: ConceptScheme
preferred label: Objectes @ca
preferred label: Objects @en