Componentes del mobiliario
type: Concept
narrower: Bisagra
preferred label: Components del mobiliari @ca
preferred label: Furnishings components @en

Bisagra
type: Concept
alternative label: charnela
broader: Componentes del mobiliario
definition: Herraje compuesto por dos piezas articuladas que, situado en el canto de una hoja de puerta o ventana, tapas de cajones que sirve para permitir que giren o se abran. El giro puede ser horizontal o vertical y las hay de varios tipos.
definition: De lant. frantissa, der. de frant, participi de frànyer, ll. frang?re trencar, amb canvi en front- per considerar que les dues peces es fan front. Ferratge compost per dues peces articulades que, situat en el cant d'una fulla de porta o finestra, tapes de calaixos que serveix per a permetre que giren o s'òbriguen. El gir pot ser horitzontal o vertical i n'hi ha de diversos tipus. @ca
definition: Hardware composed of two articulated pieces that, placed on the edge of a door or window sash, drawer covers, etc., allows them to turn or open. The turn can be horizontal or vertical and there are several types. @en
in scheme: Objetos
preferred label: Frontissa @ca
preferred label: Cotter-pin hinge @en

Objetos
type: ConceptScheme
preferred label: Objectes @ca
preferred label: Objects @en