Técnica de tejido
type: Concept
narrower: Espolinado
preferred label: Tècniques de teixit @ca
preferred label: Weaving techniques @en

Espolinado
type: Concept
alternative label: brocado
broader: Técnica de tejido
definition: Adj. Que ha sido elaborado con efectos de espolines en sus motivos decorativos, por tanto es el resultado de la aplicación de la técnica de brochar.
definition: Adj. Que ha sigut elaborat amb efectes d'espolins en els seus motius decoratius, per tant és el resultat de l'aplicació de la tècnica de brocat. @ca
definition: Adj. It refers to the action of weaving with a brocading weft, adding a supplementary weft introduced into a ground weave. @en
in scheme: Actividades
preferred label: Espolinat @ca
preferred label: Brocaded @en

Actividades
type: ConceptScheme
preferred label: Activitats @ca
preferred label: Activities @en