Procesos y técnicas por material
type: Concept
narrower: Procesos y técnicas del metal
preferred label: Processos i tècniques per material @ca
preferred label: Processes and techniques by material @en

Procesos y técnicas del metal
type: Concept
broader: Procesos y técnicas por material
definition: Conjunto de técnicas de conformación, acabado y decoración de los objetos realizados con un metal, así como de sus aleaciones.
definition: Conjunt de tècniques de conformació, acabat i decoració dels objectes realitzats amb un metall, així com dels seus aliatges. @ca
definition: Set of techniques for shaping, finishing and decorating objects made of metal and its alloys. @en
in scheme: Actividades
narrower: cincelado
preferred label: Processos i tècniques de metal @ca
preferred label: Metal working techniques and processes @en

cincelado
type: Concept
broader: Procesos y técnicas del metal
preferred label: Cisellat @ca
preferred label: Chasing @en

Actividades
type: ConceptScheme
preferred label: Activitats @ca
preferred label: Activities @en