Vivienda
type: Concept
narrower: Dormitorio

Dormitorio
type: Concept
broader: Vivienda
definition: Del lat. dormitorium. En una vivienda, habitación destinada para dormir. También se refiere a el mobiliario de un dormitorio.
definition: En una vivenda, habitació destinada per a dormir. També es referix al mobiliari d'un dormitori. @ca
definition: In a house, a room used for sleeping. Also refers to the furnishings of a bedroom. @en
in scheme: Objetos
preferred label: Dormitori @ca
preferred label: Bedroom @en

Objetos
type: ConceptScheme
preferred label: Objectes @ca
preferred label: Objects @en