Weaving techniques
type: Concept
narrower: Brocatelle
preferred label: Técnica de tejido @es
preferred label: Tècniques de teixit @ca

Brocatelle
type: Concept
broader: Weaving techniques
definition: Del lat. brocatell. Tejido de seda que se caracteriza por el relieve de sus zonas de decoración, producido por tramas de fibras vegetales, especialmente el lino pero también con cáñamo o algodón que quedan ocultas en el derecho de la tela. Originariamente era un tejido de cáñamo y seda a modo de damasco. Generalmente con dos urdimbres y mínimos dos tramas. @es
definition: De brocat. Teixit de seda que es caracteritza pel relleu de les seues zones de decoració, produït per trames de fibres vegetals, especialment el lli però també amb cànem o cotó que queden ocultes en el dret de la tela. Originàriament era un teixit de cànem i seda a manera de domàs. Generalment amb dos ordits i mínims dues trames.
definition: n. Some fabric imitating a brocade with high decorative reliefs, to make hangings and other uses on furniture. Made with cotton, or coarse silk.
in scheme: Activities
preferred label: Brocatel @es
preferred label: Brocatell @ca

Activities
type: ConceptScheme
preferred label: Actividades @es
preferred label: Activitats @ca