Contenedores por forma
type: Concept
narrower: Tarro
preferred label: Contenidors per forma @ca
preferred label: Containers by form @en

Tarro
type: Concept
alternative label: bote
broader: Contenedores por forma
definition: Recipiente usualmente de forma cilíndrica donde predomina la altura sobre el ancho. Suele tener tapadera y se usa como contenedor doméstico. Generalmente es de porcelana o vidrio.
definition: Recipient usualment de forma cilíndrica on predomina l'altura sobre l'ample. Sol tindre tapadora i s'usa com a contenidor domèstic. Generalment és de porcellana o vidre. @ca
definition: A container, usually cylindrical in shape, in which the height is greater than the width. It usually has a lid and is used as a domestic container. It is usually made of porcelain or glass. @en
in scheme: Objetos
narrower: Aceitera
preferred label: Pot @ca
preferred label: Jar @en

Aceitera
type: Concept
broader: Tarro
preferred label: Setrill @ca
preferred label: Oil can @en

Objetos
type: ConceptScheme
preferred label: Objectes @ca
preferred label: Objects @en