Componentes del mobiliario
type: Concept
narrower: Travesaño
preferred label: Components del mobiliari @ca
preferred label: Furnishings components @en

Travesaño
type: Concept
broader: Componentes del mobiliario
definition: Der. de travesar. Pieza alargada de madera que une entre sí dos partes de un mueble que soportan peso, para asegurar su estabilidad. Según su disposición el travesaño se llama superior, inferior, intermedio, medio o anterior. En la carpintería, el marco que mantiene los lados unidos.
definition: De través. Peça allargada de fusta que uneix entre sí dues parts d'un moble que suporten pes, per a assegurar la seua estabilitat. Segons la seua disposició el travesser es diu superior, inferior, intermedi, mitjà o anterior. En la fusteria, el marc que manté els costats units. @ca
definition: From Old French raille rod, from Latin r?gula ruler, straight piece of wood. An elongated piece of wood that joins two weight-bearing parts of a piece of furniture together to ensure its stability. Depending on its arrangement, the rail is called upper, lowe r, intermediate, middle or front cross member @en
in scheme: Objetos
preferred label: Travesser @ca
preferred label: Rails @en

Objetos
type: ConceptScheme
preferred label: Objectes @ca
preferred label: Objects @en