Componentes por contexto general
type: Concept
narrower: Juntas (uniones)
preferred label: Components per context general @ca
preferred label: Components by general context @en

Juntas según material
type: Concept
broader: Juntas (uniones)
preferred label: Junta segons material @ca
preferred label: Joints by material @en

Juntas (uniones)
type: Concept
broader: Componentes por contexto general
definition: Los aparatos usados o la forma de unir dos o más partes de un objeto o estructura. En encuadernación, el término describe las uniones exteriores flexibles del lomo y cubiertas de un libro. Se distingue de "bisagra (sujetadores)", que utilizan tiras de tela o de papel colocadas entre las dos mitades de una guarda donde el cuerpo del libro se fija a su cubierta.
definition: Junta Els aparells usats o la manera d'unir dues o més parts d'un objecte o estructura. En enquadernació, el terme descriu les unions exteriors flexibles del llom i cobertes d'un llibre. Es distingeix de "frontissa (sostenidors)", que utilitzen tires de tela o de paper col·locades entre les dues meitats d'una guarda on el cos del llibre es fixa a la seua coberta. @ca
definition: The apparatus used or the manner of joining two or more parts of an object or structure. In bookbinding, the term describes the flexing exterior junctions of the spine and covers of a book. Distinguished from "hinges (fasteners)", which use strips of fabric or paper placed between the two halves of an endpaper where the body of the book is fixed to its cover. @en
in scheme: Objetos
narrower: Juntas según material
preferred label: Junta (unions) @ca
preferred label: Joints (connections) @en

Objetos
type: ConceptScheme
preferred label: Objectes @ca
preferred label: Objects @en