Tarro
type: Concept
narrower: Aceitera
preferred label: Pot @ca
preferred label: Jar @en

Aceitera
type: Concept
broader: Tarro
definition: Recipiente para contener aceite con un pico o cánula vertedor.
definition: Recipient per a contindre oli amb un pic o cànula abocador. @ca
definition: A container for holding oil with a spout or pouring lip. @en
in scheme: Objetos
preferred label: Setrill @ca
preferred label: Oil can @en

Objetos
type: ConceptScheme
preferred label: Objectes @ca
preferred label: Objects @en