Juguete por forma
type: Concept
narrower: Pelota
preferred label: Joguet per forma @ca
preferred label: Toys by form @en

Pelota
type: Concept
alternative label: Balón
alternative label: Baló @ca
broader: Juguete por forma
definition: Del occit. pelota, y este der. del lat. pila. Bola hecha de una materia que le permita botar, usada en diversos juegos y deportes.
definition: Bola feta d'una matèria que li permeta botar, usada en diversos jocs i esports. @ca
definition: A ball made of a material that allows it to bounce, used in various games and sports. @en
in scheme: Objetos
preferred label: Pilota @ca
preferred label: Ball @en

Objetos
type: ConceptScheme
preferred label: Objectes @ca
preferred label: Objects @en