Jaspeado
type: Concept
broader: Pintado
preferred label: Jaspiat @ca
preferred label: Marbled @en

Pintado
type: Concept
alternative label: Pintar
broader: Revestido
definition: Del part. de pintar. Técnica de conformación o de decoración que consiste en aplicar en frío o en caliente pigmentos o colorantes aglutinados sobre la superficie de un soporte (madera, metal, muro, cerámica, tela, papel, pergamino, roca, etc.) creando una película pictórica.
definition: Tècnica de conformació o de decoració que consistix a aplicar en fred o en calent pigments o colorants aglutinats sobre la superfície d'un suport (fusta, metall, mur, ceràmica, tela, paper, pergamí, roca, etc.) creant una pel·lícula pictòrica. @ca
definition: Shaping or decorative technique consisting of hot or cold application of pigments or dyes bound on the surface of a support (wood, metal, wall, ceramic, canvas, paper, parchment, rock, etc.) to create a pictorial film. @en
in scheme: Actividades
narrower: Jaspeado
preferred label: Pintat @ca
preferred label: Painting @en

Revestido
type: Concept
narrower: Pintado
preferred label: Revestit @ca
preferred label: Coating @en

Actividades
type: ConceptScheme
preferred label: Activitats @ca
preferred label: Activities @en